Reaction Details
TargetHomeodomain-interacting protein kinase 3
LigandBDBM50355496
Substrate/Competitorn/a
Meas. Tech.ChEMBL_774503 (CHEMBL1908720)
Kd 580±n/a nM
Citation Davis, MIHunt, JPHerrgard, SCiceri, PWodicka, LMPallares, GHocker, MTreiber, DKZarrinkar, PP Comprehensive analysis of kinase inhibitor selectivity. Nat Biotechnol29:1046-51 (2011) 
 
Homeodomain-interacting protein kinase 3
Name:Homeodomain-interacting protein kinase 3
Type:PROTEIN
Mol. Mass.:133763.81
Organism:Homo sapiens (Human)
Description:ChEMBL_774503
Residue:1215
BDBM50355496
NameBDBM50355496
Synonyms:CHEMBL1908397
TypeSmall organic molecule
Emp. Form.C20H20N4O
Mol. Mass.332.399
SMILESO=C(N1CCNCC1)c1ccc(\C=C\c2n[nH]c3ccccc23)cc1