Reaction Details
TargetSerine/threonine-protein kinase 4
LigandBDBM50355496
Substrate/Competitorn/a
Meas. Tech.ChEMBL_774535 (CHEMBL1908752)
Kd 560±n/a nM
Citation Davis, MIHunt, JPHerrgard, SCiceri, PWodicka, LMPallares, GHocker, MTreiber, DKZarrinkar, PP Comprehensive analysis of kinase inhibitor selectivity. Nat Biotechnol29:1046-51 (2011) 
 
Serine/threonine-protein kinase 4
Name:Serine/threonine-protein kinase 4
Type:Enzyme
Mol. Mass.:55611.40
Organism:Homo sapiens (Human)
Description:Q13043
Residue:487
BDBM50355496
NameBDBM50355496
Synonyms:CHEMBL1908397
TypeSmall organic molecule
Emp. Form.C20H20N4O
Mol. Mass.332.399
SMILESO=C(N1CCNCC1)c1ccc(\C=C\c2n[nH]c3ccccc23)cc1