Reaction Details
TargetMitogen-activated protein kinase 14
LigandBDBM15138
Substrate/Competitorn/a
Meas. Tech.ChEMBL_774441 (CHEMBL1908658)
Kd>10000±n/a nM
Citation Davis, MIHunt, JPHerrgard, SCiceri, PWodicka, LMPallares, GHocker, MTreiber, DKZarrinkar, PP Comprehensive analysis of kinase inhibitor selectivity. Nat Biotechnol29:1046-51 (2011) 
 
Mitogen-activated protein kinase 14
Name:Mitogen-activated protein kinase 14
Type:Serine/threonine-protein kinase
Mol. Mass.:41286.76
Organism:Homo sapiens (Human)
Description:Q16539
Residue:360
BDBM15138
NameBDBM15138
Synonyms:5-indazolyl pyridine 11g A-674563 indazole-pyridine, 7
TypeSmall organic molecule
Emp. Form.C22H22N4O
Mol. Mass.358.4363
SMILESCc1n[nH]c2ccc(cc12)-c1cncc(OC[C@@H](N)Cc2ccccc2)c1