Reaction Details
TargetHormonally up-regulated neu tumor-associated kinase
LigandBDBM13530
Substrate/Competitorn/a
Meas. Tech.ChEMBL_774564 (CHEMBL1908781)
Kd>10000±n/a nM
Citation Davis, MIHunt, JPHerrgard, SCiceri, PWodicka, LMPallares, GHocker, MTreiber, DKZarrinkar, PP Comprehensive analysis of kinase inhibitor selectivity. Nat Biotechnol29:1046-51 (2011) 
 
Hormonally up-regulated neu tumor-associated kinase
Name:Hormonally up-regulated neu tumor-associated kinase
Type:PROTEIN
Mol. Mass.:79715.88
Organism:Homo sapiens (Human)
Description:ChEMBL_774564
Residue:714
BDBM13530
NameBDBM13530
Synonyms:4-[(4-methylpiperazin-1-yl)methyl]-N-[4-methyl-3-[(4-pyridin-3-ylpyrimidin-2-yl)amino]phenyl]benzamide Gleevec Imatinib, 21 STI-571 US10906896, Cpd imatinib US11725005, Compound imatinib cid_5291 med.21724, Compound 6
TypeSmall organic molecule
Emp. Form.C29H31N7O
Mol. Mass.493.6027
SMILESCN1CCN(Cc2ccc(cc2)C(=O)Nc2ccc(C)c(Nc3nccc(n3)-c3cccnc3)c2)CC1