Reaction Details
TargetCyclin-dependent kinase-like 3
LigandBDBM24773
Substrate/Competitorn/a
Meas. Tech.ChEMBL_774302 (CHEMBL1908519)
Kd>10000±n/a nM
Citation Davis, MIHunt, JPHerrgard, SCiceri, PWodicka, LMPallares, GHocker, MTreiber, DKZarrinkar, PP Comprehensive analysis of kinase inhibitor selectivity. Nat Biotechnol29:1046-51 (2011) 
 
Cyclin-dependent kinase-like 3
Name:Cyclin-dependent kinase-like 3
Type:PROTEIN
Mol. Mass.:67544.66
Organism:Homo sapiens (Human)
Description:ChEMBL_774302
Residue:592
BDBM24773
NameBDBM24773
Synonyms:AMG 706 Motesanib N-(3,3-dimethyl-1,2-dihydroindol-6-yl)-2-(pyridin-4-ylmethylamino)pyridine-3-carboxamide N-(3,3-dimethylindolin-6-yl)-2-(4-pyridylmethylamino)nicotinamide cid_11667893
TypeSmall organic molecule
Emp. Form.C22H23N5O
Mol. Mass.373.4509
SMILESCC1(C)CNc2cc(NC(=O)c3cccnc3NCc3ccncc3)ccc12