Reaction Details
TargetActivin receptor type-1B
LigandBDBM60665
Substrate/Competitorn/a
Meas. Tech.ChEMBL_774423 (CHEMBL1908640)
Kd 1100±n/a nM
Citation Davis, MIHunt, JPHerrgard, SCiceri, PWodicka, LMPallares, GHocker, MTreiber, DKZarrinkar, PP Comprehensive analysis of kinase inhibitor selectivity. Nat Biotechnol29:1046-51 (2011) 
 
Activin receptor type-1B
Name:Activin receptor type-1B
Type:PROTEIN
Mol. Mass.:56810.99
Organism:Homo sapiens (Human)
Description:ChEMBL_587064
Residue:505
BDBM60665
NameBDBM60665
Synonyms:BDBM50249542 US9212178, R406
Typen/a
Emp. Form.C22H23FN6O5
Mol. Mass.470.4536
SMILESCOc1cc(Nc2ncc(F)c(Nc3ccc4OC(C)(C)C(=O)Nc4n3)n2)cc(OC)c1OC