Reaction Details
TargetMAP/microtubule affinity-regulating kinase 4
LigandBDBM25121
Substrate/Competitorn/a
Meas. Tech.ChEMBL_774620 (CHEMBL1908837)
Kd>10000±n/a nM
Citation Davis, MIHunt, JPHerrgard, SCiceri, PWodicka, LMPallares, GHocker, MTreiber, DKZarrinkar, PP Comprehensive analysis of kinase inhibitor selectivity. Nat Biotechnol29:1046-51 (2011) 
 
MAP/microtubule affinity-regulating kinase 4
Name:MAP/microtubule affinity-regulating kinase 4
Type:PROTEIN
Mol. Mass.:82561.08
Organism:Homo sapiens (Human)
Description:ChEMBL_774620
Residue:752
BDBM25121
NameBDBM25121
Synonyms:4-{[(7R)-8-cyclopentyl-7-ethyl-5-methyl-6-oxo-5,6,7,8-tetrahydropteridin-2-yl]amino}-3-methoxy-N-(1-methylpiperidin-4-yl)benzamide CHEMBL513909 US8598172, 5
TypeSmall organic molecule
Emp. Form.C28H39N7O3
Mol. Mass.521.6544
SMILESCC[C@H]1N(C2CCCC2)c2nc(Nc3ccc(cc3OC)C(=O)NC3CCN(C)CC3)ncc2N(C)C1=O