Reaction Details
TargetEpithelial discoidin domain-containing receptor 1
LigandBDBM13533
Substrate/Competitorn/a
Meas. Tech.ChEMBL_774330 (CHEMBL1908547)
Kd 1.9±n/a nM
Citation Davis, MIHunt, JPHerrgard, SCiceri, PWodicka, LMPallares, GHocker, MTreiber, DKZarrinkar, PP Comprehensive analysis of kinase inhibitor selectivity. Nat Biotechnol29:1046-51 (2011) 
 
Epithelial discoidin domain-containing receptor 1
Name:Epithelial discoidin domain-containing receptor 1
Type:Tyrosine-protein kinase
Mol. Mass.:101130.02
Organism:Homo sapiens (Human)
Description:Q08345
Residue:913
BDBM13533
NameBDBM13533
Synonyms:1-[2-(4-methylphenyl)-5-tert-butyl-pyrazol-3-yl]-3-[4-(2-morpholin-4-ylethoxy)naphthalen-1-yl]urea 1-[5-tert-butyl-2-(4-methylphenyl)pyrazol-3-yl]-3-[4-(2-morpholin-4-ylethoxy)naphthalen-1-yl]urea 3-[2-(4-methylphenyl)-5-tert-butyl-pyrazol-3-yl]-1-[4-(2-morpholin-4-ylethoxy)naphthalen-1-yl]urea BIRB 796 BIRB-796, 3 D3RKN_73 US11407771, Compound 43 US9187470, 43 (BIRB-796) US9260410, BIRB796 diaryl urea compound 10
TypeSmall organic molecule
Emp. Form.C31H37N5O3
Mol. Mass.527.6572
SMILESCc1ccc(cc1)-n1nc(cc1NC(=O)Nc1ccc(OCCN2CCOCC2)c2ccccc12)C(C)(C)C