Reaction Details
TargetSerine/threonine-protein kinase Nek3
LigandBDBM482158
Substrate/Competitorn/a
Meas. Tech.ChEMBL_774350 (CHEMBL1908567)
Kd 8800±n/a nM
Citation Davis, MIHunt, JPHerrgard, SCiceri, PWodicka, LMPallares, GHocker, MTreiber, DKZarrinkar, PP Comprehensive analysis of kinase inhibitor selectivity. Nat Biotechnol29:1046-51 (2011) 
 
Serine/threonine-protein kinase Nek3
Name:Serine/threonine-protein kinase Nek3
Type:PROTEIN
Mol. Mass.:57709.05
Organism:Homo sapiens (Human)
Description:ChEMBL_774350
Residue:506
BDBM482158
NameBDBM482158
Synonyms:BDBM50242742 | TAE684
Typen/a
Emp. Form.C30H40ClN7O3S
Mol. Mass.614.202
SMILESCOc1cc(ccc1Nc1ncc(Cl)c(Nc2ccccc2S(=O)(=O)C(C)C)n1)N1CCC(CC1)N1CCN(C)CC1