Reaction Details
TargetcGMP-dependent protein kinase 2
LigandBDBM27817
Substrate/Competitorn/a
Meas. Tech.ChEMBL_774533 (CHEMBL1908750)
Kd>10000±n/a nM
Citation Davis, MIHunt, JPHerrgard, SCiceri, PWodicka, LMPallares, GHocker, MTreiber, DKZarrinkar, PP Comprehensive analysis of kinase inhibitor selectivity. Nat Biotechnol29:1046-51 (2011) 
 
cGMP-dependent protein kinase 2
Name:cGMP-dependent protein kinase 2
Type:PROTEIN
Mol. Mass.:87448.25
Organism:Homo sapiens (Human)
Description:ChEMBL_774533
Residue:762
BDBM27817
NameBDBM27817
Synonyms:2-{[2-({1-[2-(dimethylamino)acetyl]-5-methoxy-2,3-dihydro-1H-indol-6-yl}amino)-7H-pyrrolo[2,3-d]pyrimidin-4-yl]amino}-6-fluoro-N-methylbenzamide | pyrrolo[2,3-d]pyrimidine deriv., 40
TypeSmall organic molecule
Emp. Form.C27H29FN8O3
Mol. Mass.532.5694
SMILESCNC(=O)c1c(F)cccc1Nc1nc(Nc2cc3N(CCc3cc2OC)C(=O)CN(C)C)nc2[nH]ccc12