Reaction Details
TargetALK tyrosine kinase receptor
LigandBDBM482158
Substrate/Competitorn/a
Meas. Tech.ChEMBL_774424 (CHEMBL1908641)
Kd 1.1±n/a nM
Citation Davis, MIHunt, JPHerrgard, SCiceri, PWodicka, LMPallares, GHocker, MTreiber, DKZarrinkar, PP Comprehensive analysis of kinase inhibitor selectivity. Nat Biotechnol29:1046-51 (2011) 
 
ALK tyrosine kinase receptor
Name:ALK tyrosine kinase receptor
Type:Protein
Mol. Mass.:176453.10
Organism:Homo sapiens (Human)
Description:Q9UM73
Residue:1620
BDBM482158
NameBDBM482158
Synonyms:BDBM50242742 | TAE684
Typen/a
Emp. Form.C30H40ClN7O3S
Mol. Mass.614.202
SMILESCOc1cc(ccc1Nc1ncc(Cl)c(Nc2ccccc2S(=O)(=O)C(C)C)n1)N1CCC(CC1)N1CCN(C)CC1