Reaction Details
TargetDual specificity protein kinase CLK1
LigandBDBM26474
Substrate/Competitorn/a
Meas. Tech.ChEMBL_774244 (CHEMBL1908461)
Kd>10000±n/a nM
Citation Davis, MIHunt, JPHerrgard, SCiceri, PWodicka, LMPallares, GHocker, MTreiber, DKZarrinkar, PP Comprehensive analysis of kinase inhibitor selectivity. Nat Biotechnol29:1046-51 (2011) 
 
Dual specificity protein kinase CLK1
Name:Dual specificity protein kinase CLK1
Type:Protein
Mol. Mass.:57322.21
Organism:Homo sapiens (Human)
Description:P49759
Residue:484
BDBM26474
NameBDBM26474
Synonyms:5-({4-[(2,3-dimethyl-2H-indazol-6-yl)(methyl)amino]pyrimidin-2-yl}amino)-2-methylbenzene-1-sulfonamide JMC514632 Compound 13 cid_10113978
TypeSmall organic molecule
Emp. Form.C21H23N7O2S
Mol. Mass.437.518
SMILESCN(c1ccc2c(C)n(C)nc2c1)c1ccnc(Nc2ccc(C)c(c2)S(N)(=O)=O)n1