Reaction Details
TargetReceptor-interacting serine/threonine-protein kinase 4
LigandBDBM25121
Substrate/Competitorn/a
Meas. Tech.ChEMBL_774243 (CHEMBL1908460)
Kd>10000±n/a nM
Citation Davis, MIHunt, JPHerrgard, SCiceri, PWodicka, LMPallares, GHocker, MTreiber, DKZarrinkar, PP Comprehensive analysis of kinase inhibitor selectivity. Nat Biotechnol29:1046-51 (2011) 
 
Receptor-interacting serine/threonine-protein kinase 4
Name:Receptor-interacting serine/threonine-protein kinase 4
Type:PROTEIN
Mol. Mass.:91622.31
Organism:Homo sapiens (Human)
Description:ChEMBL_774243
Residue:832
BDBM25121
NameBDBM25121
Synonyms:4-{[(7R)-8-cyclopentyl-7-ethyl-5-methyl-6-oxo-5,6,7,8-tetrahydropteridin-2-yl]amino}-3-methoxy-N-(1-methylpiperidin-4-yl)benzamide CHEMBL513909 US8598172, 5
TypeSmall organic molecule
Emp. Form.C28H39N7O3
Mol. Mass.521.6544
SMILESCC[C@H]1N(C2CCCC2)c2nc(Nc3ccc(cc3OC)C(=O)NC3CCN(C)CC3)ncc2N(C)C1=O