Reaction Details
TargetSerine/threonine-protein kinase 38
LigandBDBM50128285
Substrate/Competitorn/a
Meas. Tech.ChEMBL_774547 (CHEMBL1908764)
Kd>10000±n/a nM
Citation Davis, MIHunt, JPHerrgard, SCiceri, PWodicka, LMPallares, GHocker, MTreiber, DKZarrinkar, PP Comprehensive analysis of kinase inhibitor selectivity. Nat Biotechnol29:1046-51 (2011) 
 
Serine/threonine-protein kinase 38
Name:Serine/threonine-protein kinase 38
Type:PROTEIN
Mol. Mass.:54194.13
Organism:Homo sapiens (Human)
Description:ChEMBL_774547
Residue:465
BDBM50128285
NameBDBM50128285
Synonyms:3-(1-Methyl-1H-indol-3-yl)-4-[1-(1-pyridin-2-ylmethyl-piperidin-4-yl)-1H-indol-3-yl]-pyrrole-2,5-dione | CHEMBL300138
TypeSmall organic molecule
Emp. Form.C32H29N5O2
Mol. Mass.515.605
SMILESCn1cc(C2=C(C(=O)NC2=O)c2cn(C3CCN(Cc4ccccn4)CC3)c3ccccc23)c2ccccc12