Reaction Details
TargetEphrin type-A receptor 3
LigandBDBM21079
Substrate/Competitorn/a
Meas. Tech.ChEMBL_774489 (CHEMBL1908706)
Kd 3500±n/a nM
Citation Davis, MIHunt, JPHerrgard, SCiceri, PWodicka, LMPallares, GHocker, MTreiber, DKZarrinkar, PP Comprehensive analysis of kinase inhibitor selectivity. Nat Biotechnol29:1046-51 (2011) 
 
Ephrin type-A receptor 3
Name:Ephrin type-A receptor 3
Type:Protein
Mol. Mass.:110131.95
Organism:Homo sapiens (Human)
Description:P29320
Residue:983
BDBM21079
NameBDBM21079
Synonyms:1-[4-(3-amino-1H-indazol-4-yl)phenyl]-3-(2-fluoro-5-methyl-phenyl)urea 1-[4-(3-azanyl-1H-indazol-4-yl)phenyl]-3-(2-fluoranyl-5-methyl-phenyl)urea ABT-869 CHEMBL223360 | cid_11485656
TypeSmall organic molecule
Emp. Form.C21H18FN5O
Mol. Mass.375.3989
SMILESCc1ccc(F)c(NC(=O)Nc2ccc(cc2)-c2cccc3[nH]nc(N)c23)c1