Reaction Details
TargetDual specificity protein kinase TTK
LigandBDBM50355496
Substrate/Competitorn/a
Meas. Tech.ChEMBL_774390 (CHEMBL1908607)
Kd 110±n/a nM
Citation Davis, MIHunt, JPHerrgard, SCiceri, PWodicka, LMPallares, GHocker, MTreiber, DKZarrinkar, PP Comprehensive analysis of kinase inhibitor selectivity. Nat Biotechnol29:1046-51 (2011) 
 
Dual specificity protein kinase TTK
Name:Dual specificity protein kinase TTK
Type:Protein
Mol. Mass.:97086.79
Organism:Homo sapiens (Human)
Description:P33981
Residue:857
BDBM50355496
NameBDBM50355496
Synonyms:CHEMBL1908397
TypeSmall organic molecule
Emp. Form.C20H20N4O
Mol. Mass.332.399
SMILESO=C(N1CCNCC1)c1ccc(\C=C\c2n[nH]c3ccccc23)cc1