Reaction Details
TargetHomeodomain-interacting protein kinase 1
LigandBDBM15138
Substrate/Competitorn/a
Meas. Tech.ChEMBL_774206 (CHEMBL1908423)
Kd 230±n/a nM
Citation Davis, MIHunt, JPHerrgard, SCiceri, PWodicka, LMPallares, GHocker, MTreiber, DKZarrinkar, PP Comprehensive analysis of kinase inhibitor selectivity. Nat Biotechnol29:1046-51 (2011) 
 
Homeodomain-interacting protein kinase 1
Name:Homeodomain-interacting protein kinase 1
Type:PROTEIN
Mol. Mass.:130868.34
Organism:Homo sapiens (Human)
Description:ChEMBL_1459267
Residue:1210
BDBM15138
NameBDBM15138
Synonyms:5-indazolyl pyridine 11g A-674563 indazole-pyridine, 7
TypeSmall organic molecule
Emp. Form.C22H22N4O
Mol. Mass.358.4363
SMILESCc1n[nH]c2ccc(cc12)-c1cncc(OC[C@@H](N)Cc2ccccc2)c1