Reaction Details
TargetMitogen-activated protein kinase kinase kinase 6
LigandBDBM60589
Substrate/Competitorn/a
Meas. Tech.ChEMBL_774442 (CHEMBL1908659)
Kd>10000±n/a nM
Citation Davis, MIHunt, JPHerrgard, SCiceri, PWodicka, LMPallares, GHocker, MTreiber, DKZarrinkar, PP Comprehensive analysis of kinase inhibitor selectivity. Nat Biotechnol29:1046-51 (2011) 
 
Mitogen-activated protein kinase kinase kinase 6
Name:Mitogen-activated protein kinase kinase kinase 6
Type:PROTEIN
Mol. Mass.:142605.03
Organism:Homo sapiens (Human)
Description:ChEMBL_655684
Residue:1288
BDBM60589
NameBDBM60589
Synonyms:6-{[6-(1-methyl-1H-pyrazol-4-yl)-[1,2,4]triazolo[4,3-b]pyridazin-3-yl]sulfanyl}quinoline (4) | BDBM50355498
Typen/a
Emp. Form.C18H13N7S
Mol. Mass.359.408
SMILESCn1cc(cn1)-c1ccc2nnc(Sc3ccc4ncccc4c3)n2n1