Reaction Details
TargetSerine/threonine-protein kinase DCLK1
LigandBDBM60589
Substrate/Competitorn/a
Meas. Tech.ChEMBL_774446 (CHEMBL1908663)
Kd>10000±n/a nM
Citation Davis, MIHunt, JPHerrgard, SCiceri, PWodicka, LMPallares, GHocker, MTreiber, DKZarrinkar, PP Comprehensive analysis of kinase inhibitor selectivity. Nat Biotechnol29:1046-51 (2011) 
 
Serine/threonine-protein kinase DCLK1
Name:Serine/threonine-protein kinase DCLK1
Type:PROTEIN
Mol. Mass.:82239.64
Organism:Homo sapiens (Human)
Description:ChEMBL_774446
Residue:740
BDBM60589
NameBDBM60589
Synonyms:6-{[6-(1-methyl-1H-pyrazol-4-yl)-[1,2,4]triazolo[4,3-b]pyridazin-3-yl]sulfanyl}quinoline (4) | BDBM50355498
Typen/a
Emp. Form.C18H13N7S
Mol. Mass.359.408
SMILESCn1cc(cn1)-c1ccc2nnc(Sc3ccc4ncccc4c3)n2n1