Reaction Details
TargetCyclin-dependent kinase-like 5
LigandBDBM36409
Substrate/Competitorn/a
Meas. Tech.ChEMBL_774385 (CHEMBL1908602)
Kd>10000±n/a nM
Citation Davis, MIHunt, JPHerrgard, SCiceri, PWodicka, LMPallares, GHocker, MTreiber, DKZarrinkar, PP Comprehensive analysis of kinase inhibitor selectivity. Nat Biotechnol29:1046-51 (2011) 
 
Cyclin-dependent kinase-like 5
Name:Cyclin-dependent kinase-like 5
Type:PROTEIN
Mol. Mass.:115595.39
Organism:Homo sapiens (Human)
Description:ChEMBL_655722
Residue:1030
BDBM36409
NameBDBM36409
Synonyms:2-(4-amino-1-isopropyl-1H-pyrazolo[3,4-d]pyrimidin-3-yl)-1H-indol-5-ol, PP242 US10172858, Table 2.1 | US9828378, # 1
TypeSmall organic molecule
Emp. Form.C16H16N6O
Mol. Mass.308.3378
SMILESCC(C)n1nc(-c2cc3cc(O)ccc3[nH]2)c2c(N)ncnc12