Reaction Details
TargetSerine/threonine-protein kinase RIO3
LigandBDBM36409
Substrate/Competitorn/a
Meas. Tech.ChEMBL_774406 (CHEMBL1908623)
Kd>10000±n/a nM
Citation Davis, MIHunt, JPHerrgard, SCiceri, PWodicka, LMPallares, GHocker, MTreiber, DKZarrinkar, PP Comprehensive analysis of kinase inhibitor selectivity. Nat Biotechnol29:1046-51 (2011) 
 
Serine/threonine-protein kinase RIO3
Name:Serine/threonine-protein kinase RIO3
Type:PROTEIN
Mol. Mass.:59082.79
Organism:Homo sapiens (Human)
Description:ChEMBL_774406
Residue:519
BDBM36409
NameBDBM36409
Synonyms:2-(4-amino-1-isopropyl-1H-pyrazolo[3,4-d]pyrimidin-3-yl)-1H-indol-5-ol, PP242 US10172858, Table 2.1 | US9828378, # 1
TypeSmall organic molecule
Emp. Form.C16H16N6O
Mol. Mass.308.3378
SMILESCC(C)n1nc(-c2cc3cc(O)ccc3[nH]2)c2c(N)ncnc12