Reaction Details
TargetSerine/threonine-protein kinase TAO2
LigandBDBM50309910
Substrate/Competitorn/a
Meas. Tech.ChEMBL_774579 (CHEMBL1908796)
Kd>10000±n/a nM
Citation Davis, MIHunt, JPHerrgard, SCiceri, PWodicka, LMPallares, GHocker, MTreiber, DKZarrinkar, PP Comprehensive analysis of kinase inhibitor selectivity. Nat Biotechnol29:1046-51 (2011) 
 
Serine/threonine-protein kinase TAO2
Name:Serine/threonine-protein kinase TAO2
Type:Enzyme
Mol. Mass.:138262.36
Organism:Homo sapiens (Human)
Description:Q9UL54
Residue:1235
BDBM50309910
NameBDBM50309910
Synonyms:CHEMBL608154 N-(6-chloro-7-methoxy-9H-pyrido[3,4-b]indol-8-yl)-2-methylnicotinamide
TypeSmall organic molecule
Emp. Form.C19H15ClN4O2
Mol. Mass.366.801
SMILESCOc1c(Cl)cc2c3ccncc3[nH]c2c1NC(=O)c1cccnc1C