Reaction Details
TargetLIM domain kinase 2
LigandBDBM50242737
Substrate/Competitorn/a
Meas. Tech.ChEMBL_774501 (CHEMBL1908718)
Kd>10000±n/a nM
Citation Davis, MIHunt, JPHerrgard, SCiceri, PWodicka, LMPallares, GHocker, MTreiber, DKZarrinkar, PP Comprehensive analysis of kinase inhibitor selectivity. Nat Biotechnol29:1046-51 (2011) 
 
LIM domain kinase 2
Name:LIM domain kinase 2
Type:PROTEIN
Mol. Mass.:72238.81
Organism:Homo sapiens (Human)
Description:ChEMBL_1514398
Residue:638
BDBM50242737
NameBDBM50242737
Synonyms:(R,Z)-5-(2,6-dichlorobenzylsulfonyl)-3-((3,5-dimethyl-4-(2-(pyrrolidin-1-ylmethyl)pyrrolidine-1-carbonyl)-1H-pyrrol-2-yl)methylene)indolin-2-one PHA-665752 | TCMDC-125885
TypeSmall organic molecule
Emp. Form.C32H34Cl2N4O4S
Mol. Mass.641.608
SMILESCc1[nH]c(\C=C2/C(=O)Nc3ccc(cc23)S(=O)(=O)Cc2c(Cl)cccc2Cl)c(C)c1C(=O)N1CCC[C@@H]1CN1CCCC1