Reaction Details
TargetMitogen-activated protein kinase kinase kinase 3
LigandBDBM50355497
Substrate/Competitorn/a
Meas. Tech.ChEMBL_774345 (CHEMBL1908562)
Kd>10000±n/a nM
Citation Davis, MIHunt, JPHerrgard, SCiceri, PWodicka, LMPallares, GHocker, MTreiber, DKZarrinkar, PP Comprehensive analysis of kinase inhibitor selectivity. Nat Biotechnol29:1046-51 (2011) 
 
Mitogen-activated protein kinase kinase kinase 3
Name:Mitogen-activated protein kinase kinase kinase 3
Type:PROTEIN
Mol. Mass.:70916.05
Organism:Homo sapiens (Human)
Description:ChEMBL_774345
Residue:626
BDBM50355497
NameBDBM50355497
Synonyms:AZD-6244 | CHEMBL1614701
TypeSmall organic molecule
Emp. Form.C17H15BrClFN4O3
Mol. Mass.457.681
SMILESCn1cnc2c(F)c(Nc3ccc(Br)cc3Cl)c(cc12)C(=O)NOCCO