Reaction Details
TargetCasein kinase I isoform gamma-3
LigandBDBM5931
Substrate/Competitorn/a
Meas. Tech.ChEMBL_774429 (CHEMBL1908646)
Kd>10000±n/a nM
Citation Davis, MIHunt, JPHerrgard, SCiceri, PWodicka, LMPallares, GHocker, MTreiber, DKZarrinkar, PP Comprehensive analysis of kinase inhibitor selectivity. Nat Biotechnol29:1046-51 (2011) 
 
Casein kinase I isoform gamma-3
Name:Casein kinase I isoform gamma-3
Type:PROTEIN
Mol. Mass.:51411.12
Organism:Homo sapiens (Human)
Description:ChEMBL_1440403
Residue:447
BDBM5931
NameBDBM5931
Synonyms:BMS-387072 N-(5-{[(5-tert-butyl-1,3-oxazol-2-yl)methyl]sulfanyl}-1,3-thiazol-2-yl)piperidine-4-carboxamide cid_3025986
TypeSmall organic molecule
Emp. Form.C17H24N4O2S2
Mol. Mass.380.528
SMILESCC(C)(C)c1cnc(CSc2cnc(NC(=O)C3CCNCC3)s2)o1