Reaction Details
TargetTransient receptor potential cation channel subfamily M member 6
LigandBDBM50242737
Substrate/Competitorn/a
Meas. Tech.ChEMBL_774590 (CHEMBL1908807)
Kd>10000±n/a nM
Citation Davis, MIHunt, JPHerrgard, SCiceri, PWodicka, LMPallares, GHocker, MTreiber, DKZarrinkar, PP Comprehensive analysis of kinase inhibitor selectivity. Nat Biotechnol29:1046-51 (2011) 
 
Transient receptor potential cation channel subfamily M member 6
Name:Transient receptor potential cation channel subfamily M member 6
Type:PROTEIN
Mol. Mass.:231743.84
Organism:Homo sapiens (Human)
Description:ChEMBL_774590
Residue:2022
BDBM50242737
NameBDBM50242737
Synonyms:(R,Z)-5-(2,6-dichlorobenzylsulfonyl)-3-((3,5-dimethyl-4-(2-(pyrrolidin-1-ylmethyl)pyrrolidine-1-carbonyl)-1H-pyrrol-2-yl)methylene)indolin-2-one PHA-665752 | TCMDC-125885
TypeSmall organic molecule
Emp. Form.C32H34Cl2N4O4S
Mol. Mass.641.608
SMILESCc1[nH]c(\C=C2/C(=O)Nc3ccc(cc23)S(=O)(=O)Cc2c(Cl)cccc2Cl)c(C)c1C(=O)N1CCC[C@@H]1CN1CCCC1