Reaction Details
TargetRibosomal protein S6 kinase alpha-4
LigandBDBM50355500
Substrate/Competitorn/a
Meas. Tech.ChEMBL_774407 (CHEMBL1908624)
Kd 740±n/a nM
Citation Davis, MIHunt, JPHerrgard, SCiceri, PWodicka, LMPallares, GHocker, MTreiber, DKZarrinkar, PP Comprehensive analysis of kinase inhibitor selectivity. Nat Biotechnol29:1046-51 (2011) 
 
Ribosomal protein S6 kinase alpha-4
Name:Ribosomal protein S6 kinase alpha-4
Type:Serine/threonine-protein kinase
Mol. Mass.:85620.38
Organism:Homo sapiens (Human)
Description:Recombinant MSK2 was phosphorylated by incubation with active p38alpha before assays.
Residue:772
BDBM50355500
NameBDBM50355500
Synonyms:CHEMBL1908394 | US9695172, GSK461364
TypeSmall organic molecule
Emp. Form.C27H28F3N5O2S
Mol. Mass.543.604
SMILESC[C@@H](Oc1cc(sc1C(N)=O)-n1cnc2ccc(CN3CCN(C)CC3)cc12)c1ccccc1C(F)(F)F