Reaction Details
TargetCyclin-dependent kinase 5
LigandBDBM50355500
Substrate/Competitorn/a
Meas. Tech.ChEMBL_774450 (CHEMBL1908667)
Kd>10000±n/a nM
Citation Davis, MIHunt, JPHerrgard, SCiceri, PWodicka, LMPallares, GHocker, MTreiber, DKZarrinkar, PP Comprehensive analysis of kinase inhibitor selectivity. Nat Biotechnol29:1046-51 (2011) 
 
Cyclin-dependent kinase 5
Name:Cyclin-dependent kinase 5
Type:Enzyme Subunit
Mol. Mass.:33308.61
Organism:Homo sapiens (Human)
Description:n/a
Residue:292
BDBM50355500
NameBDBM50355500
Synonyms:CHEMBL1908394 | US9695172, GSK461364
TypeSmall organic molecule
Emp. Form.C27H28F3N5O2S
Mol. Mass.543.604
SMILESC[C@@H](Oc1cc(sc1C(N)=O)-n1cnc2ccc(CN3CCN(C)CC3)cc12)c1ccccc1C(F)(F)F