Reaction Details
TargetTyrosine-protein kinase ITK/TSK
LigandBDBM482158
Substrate/Competitorn/a
Meas. Tech.ChEMBL_774500 (CHEMBL1908717)
Kd 34±n/a nM
Citation Davis, MIHunt, JPHerrgard, SCiceri, PWodicka, LMPallares, GHocker, MTreiber, DKZarrinkar, PP Comprehensive analysis of kinase inhibitor selectivity. Nat Biotechnol29:1046-51 (2011) 
 
Tyrosine-protein kinase ITK/TSK
Name:Tyrosine-protein kinase ITK/TSK
Type:Protein
Mol. Mass.:71839.20
Organism:Homo sapiens (Human)
Description:Q08881
Residue:620
BDBM482158
NameBDBM482158
Synonyms:BDBM50242742 | TAE684
Typen/a
Emp. Form.C30H40ClN7O3S
Mol. Mass.614.202
SMILESCOc1cc(ccc1Nc1ncc(Cl)c(Nc2ccccc2S(=O)(=O)C(C)C)n1)N1CCC(CC1)N1CCN(C)CC1