Reaction Details
Target5'-AMP-activated protein kinase catalytic subunit alpha-2
LigandBDBM482158
Substrate/Competitorn/a
Meas. Tech.ChEMBL_774527 (CHEMBL1908744)
Kd 49±n/a nM
Citation Davis, MIHunt, JPHerrgard, SCiceri, PWodicka, LMPallares, GHocker, MTreiber, DKZarrinkar, PP Comprehensive analysis of kinase inhibitor selectivity. Nat Biotechnol29:1046-51 (2011) 
 
5'-AMP-activated protein kinase catalytic subunit alpha-2
Name:5'-AMP-activated protein kinase catalytic subunit alpha-2
Type:Enzyme
Mol. Mass.:62331.02
Organism:Homo sapiens (Human)
Description:P54646
Residue:552
BDBM482158
NameBDBM482158
Synonyms:BDBM50242742 | TAE684
Typen/a
Emp. Form.C30H40ClN7O3S
Mol. Mass.614.202
SMILESCOc1cc(ccc1Nc1ncc(Cl)c(Nc2ccccc2S(=O)(=O)C(C)C)n1)N1CCC(CC1)N1CCN(C)CC1