Reaction Details
TargetMyosin light chain kinase family member 4
LigandBDBM31088
Substrate/Competitorn/a
Meas. Tech.ChEMBL_774289 (CHEMBL1908506)
Kd>10000±n/a nM
Citation Davis, MIHunt, JPHerrgard, SCiceri, PWodicka, LMPallares, GHocker, MTreiber, DKZarrinkar, PP Comprehensive analysis of kinase inhibitor selectivity. Nat Biotechnol29:1046-51 (2011) 
 
Myosin light chain kinase family member 4
Name:Myosin light chain kinase family member 4
Type:PROTEIN
Mol. Mass.:44505.40
Organism:Homo sapiens (Human)
Description:ChEMBL_774289
Residue:388
BDBM31088
NameBDBM31088
Synonyms:1-methyl-5-[2-[5-(trifluoromethyl)-1H-imidazol-2-yl]pyridin-4-yl]oxy-N-[4-(trifluoromethyl)phenyl]benzimidazol-2-amine CHIR-265 cid_11656518
TypeSmall organic molecule
Emp. Form.C24H16F6N6O
Mol. Mass.518.4139
SMILESCn1c(Nc2ccc(cc2)C(F)(F)F)nc2cc(Oc3ccnc(c3)-c3ncc([nH]3)C(F)(F)F)ccc12