Reaction Details
TargetBone morphogenetic protein receptor type-2
LigandBDBM17055
Substrate/Competitorn/a
Meas. Tech.ChEMBL_774306 (CHEMBL1908523)
Kd>10000±n/a nM
Citation Davis, MIHunt, JPHerrgard, SCiceri, PWodicka, LMPallares, GHocker, MTreiber, DKZarrinkar, PP Comprehensive analysis of kinase inhibitor selectivity. Nat Biotechnol29:1046-51 (2011) 
 
Bone morphogenetic protein receptor type-2
Name:Bone morphogenetic protein receptor type-2
Type:PROTEIN
Mol. Mass.:115194.11
Organism:Homo sapiens (Human)
Description:ChEMBL_774306
Residue:1038
BDBM17055
NameBDBM17055
Synonyms:(18S)-18-[(dimethylamino)methyl]-17-oxa-4,14,21-triazahexacyclo[19.6.1.1^{7,14}.0^{2,6}.0^{8,13}.0^{22,27}]nonacosa-1(28),2(6),7(29),8(13),9,11,22(27),23,25-nonaene-3,5-dione K00587a LY-333531 Ruboxistaurin | cid_153999
TypeSmall organic molecule
Emp. Form.C28H28N4O3
Mol. Mass.468.5469
SMILESCN(C)C[C@@H]1CCn2cc(C3=C(C(=O)NC3=O)c3cn(CCO1)c1ccccc31)c1ccccc21