Reaction Details
TargetActivin receptor type-2B
LigandBDBM50355500
Substrate/Competitorn/a
Meas. Tech.ChEMBL_774300 (CHEMBL1908517)
Kd>10000±n/a nM
Citation Davis, MIHunt, JPHerrgard, SCiceri, PWodicka, LMPallares, GHocker, MTreiber, DKZarrinkar, PP Comprehensive analysis of kinase inhibitor selectivity. Nat Biotechnol29:1046-51 (2011) 
 
Activin receptor type-2B
Name:Activin receptor type-2B
Type:Enzyme Catalytic Domain
Mol. Mass.:57713.76
Organism:Homo sapiens (Human)
Description:gi_116734708
Residue:512
BDBM50355500
NameBDBM50355500
Synonyms:CHEMBL1908394 | US9695172, GSK461364
TypeSmall organic molecule
Emp. Form.C27H28F3N5O2S
Mol. Mass.543.604
SMILESC[C@@H](Oc1cc(sc1C(N)=O)-n1cnc2ccc(CN3CCN(C)CC3)cc12)c1ccccc1C(F)(F)F