Reaction Details
TargetSerine/threonine-protein kinase PAK 1
LigandBDBM60665
Substrate/Competitorn/a
Meas. Tech.ChEMBL_774351 (CHEMBL1908568)
Kd 260±n/a nM
Citation Davis, MIHunt, JPHerrgard, SCiceri, PWodicka, LMPallares, GHocker, MTreiber, DKZarrinkar, PP Comprehensive analysis of kinase inhibitor selectivity. Nat Biotechnol29:1046-51 (2011) 
 
Serine/threonine-protein kinase PAK 1
Name:Serine/threonine-protein kinase PAK 1
Type:n/a
Mol. Mass.:60640.15
Organism:Homo sapiens (Human)
Description:Q13153
Residue:545
BDBM60665
NameBDBM60665
Synonyms:BDBM50249542 US9212178, R406
Typen/a
Emp. Form.C22H23FN6O5
Mol. Mass.470.4536
SMILESCOc1cc(Nc2ncc(F)c(Nc3ccc4OC(C)(C)C(=O)Nc4n3)n2)cc(OC)c1OC