Reaction Details
TargetAtypical kinase COQ8B, mitochondrial
LigandBDBM36409
Substrate/Competitorn/a
Meas. Tech.ChEMBL_774615 (CHEMBL1908832)
Kd 3500±n/a nM
Citation Davis, MIHunt, JPHerrgard, SCiceri, PWodicka, LMPallares, GHocker, MTreiber, DKZarrinkar, PP Comprehensive analysis of kinase inhibitor selectivity. Nat Biotechnol29:1046-51 (2011) 
 
Atypical kinase COQ8B, mitochondrial
Name:Atypical kinase COQ8B, mitochondrial
Type:PROTEIN
Mol. Mass.:60073.32
Organism:Homo sapiens (Human)
Description:ChEMBL_586944
Residue:544
BDBM36409
NameBDBM36409
Synonyms:2-(4-amino-1-isopropyl-1H-pyrazolo[3,4-d]pyrimidin-3-yl)-1H-indol-5-ol, PP242 US10172858, Table 2.1 | US9828378, # 1
TypeSmall organic molecule
Emp. Form.C16H16N6O
Mol. Mass.308.3378
SMILESCC(C)n1nc(-c2cc3cc(O)ccc3[nH]2)c2c(N)ncnc12