Reaction Details
TargetBDNF/NT-3 growth factors receptor
LigandBDBM50355504
Substrate/Competitorn/a
Meas. Tech.ChEMBL_774512 (CHEMBL1908729)
Kd 4.1±n/a nM
Citation Davis, MIHunt, JPHerrgard, SCiceri, PWodicka, LMPallares, GHocker, MTreiber, DKZarrinkar, PP Comprehensive analysis of kinase inhibitor selectivity. Nat Biotechnol29:1046-51 (2011) 
 
BDNF/NT-3 growth factors receptor
Name:BDNF/NT-3 growth factors receptor
Type:Enzyme
Mol. Mass.:91996.87
Organism:Homo sapiens (Human)
Description:Q16620
Residue:822
BDBM50355504
NameBDBM50355504
Synonyms:CHEMBL1908393
TypeSmall organic molecule
Emp. Form.C34H36F2N4O6
Mol. Mass.634.6696
SMILESCOc1cc2c(Oc3ccc(NC(=O)C4(CC4)C(=O)NC4=CCC(F)C=C4)cc3F)ccnc2cc1OCCCN1CCOCC1