Reaction Details
TargetcGMP-dependent protein kinase 2
LigandBDBM4552
Substrate/Competitorn/a
Meas. Tech.ChEMBL_774533 (CHEMBL1908750)
Kd>10000±n/a nM
Citation Davis, MIHunt, JPHerrgard, SCiceri, PWodicka, LMPallares, GHocker, MTreiber, DKZarrinkar, PP Comprehensive analysis of kinase inhibitor selectivity. Nat Biotechnol29:1046-51 (2011) 
 
cGMP-dependent protein kinase 2
Name:cGMP-dependent protein kinase 2
Type:PROTEIN
Mol. Mass.:87448.25
Organism:Homo sapiens (Human)
Description:ChEMBL_774533
Residue:762
BDBM4552
NameBDBM4552
Synonyms:4-[(2,4-Dichloro-5-methoxyphenyl)amino]-6-methoxy-7-[3-(4-methyl-1-piperazinyl)propoxy]-3-quinolinecarbonitrile BOSUTINIB SKI-606
TypeSmall organic molecule
Emp. Form.C26H29Cl2N5O3
Mol. Mass.530.446
SMILESCOc1cc(Nc2c(cnc3cc(OCCCN4CCN(C)CC4)c(OC)cc23)C#N)c(Cl)cc1Cl