Reaction Details
TargetDual specificity mitogen-activated protein kinase kinase 7
LigandBDBM5931
Substrate/Competitorn/a
Meas. Tech.ChEMBL_774202 (CHEMBL1908419)
Kd>10000±n/a nM
Citation Davis, MIHunt, JPHerrgard, SCiceri, PWodicka, LMPallares, GHocker, MTreiber, DKZarrinkar, PP Comprehensive analysis of kinase inhibitor selectivity. Nat Biotechnol29:1046-51 (2011) 
 
Dual specificity mitogen-activated protein kinase kinase 7
Name:Dual specificity mitogen-activated protein kinase kinase 7
Type:Protein
Mol. Mass.:47502.52
Organism:Homo sapiens (Human)
Description:O14733
Residue:419
BDBM5931
NameBDBM5931
Synonyms:BMS-387072 N-(5-{[(5-tert-butyl-1,3-oxazol-2-yl)methyl]sulfanyl}-1,3-thiazol-2-yl)piperidine-4-carboxamide cid_3025986
TypeSmall organic molecule
Emp. Form.C17H24N4O2S2
Mol. Mass.380.528
SMILESCC(C)(C)c1cnc(CSc2cnc(NC(=O)C3CCNCC3)s2)o1