Reaction Details
TargetActivin receptor type-2B
LigandBDBM5446
Substrate/Competitorn/a
Meas. Tech.ChEMBL_774300 (CHEMBL1908517)
Kd>10000±n/a nM
Citation Davis, MIHunt, JPHerrgard, SCiceri, PWodicka, LMPallares, GHocker, MTreiber, DKZarrinkar, PP Comprehensive analysis of kinase inhibitor selectivity. Nat Biotechnol29:1046-51 (2011) 
 
Activin receptor type-2B
Name:Activin receptor type-2B
Type:Enzyme Catalytic Domain
Mol. Mass.:57713.76
Organism:Homo sapiens (Human)
Description:gi_116734708
Residue:512
BDBM5446
NameBDBM5446
Synonyms:CHEMBL553 Erlotinib N-(3-Ethynylphenyl)-6,7-bis(2-methoxyethoxy)-4-quinazolinamine Monohydrochloride OSI-774 US10189853, erlotinib US11524945, Compound Erlotinib US9730934, Erlotinib cid_176870
TypeSmall organic molecule
Emp. Form.C22H23N3O4
Mol. Mass.393.4357
SMILESCOCCOc1cc2ncnc(Nc3cccc(c3)C#C)c2cc1OCCOC