Reaction Details
TargetPeripheral plasma membrane protein CASK
LigandBDBM50355501
Substrate/Competitorn/a
Meas. Tech.ChEMBL_774229 (CHEMBL1908446)
Kd 1500±n/a nM
Citation Davis, MIHunt, JPHerrgard, SCiceri, PWodicka, LMPallares, GHocker, MTreiber, DKZarrinkar, PP Comprehensive analysis of kinase inhibitor selectivity. Nat Biotechnol29:1046-51 (2011) 
 
Peripheral plasma membrane protein CASK
Name:Peripheral plasma membrane protein CASK
Type:PROTEIN
Mol. Mass.:105119.01
Organism:Homo sapiens (Human)
Description:ChEMBL_774229
Residue:926
BDBM50355501
NameBDBM50355501
Synonyms:INCB-018424 RUXOLITINIB PHOSPHATE US10766894, Compound TABLE 1.1 US11203595, TABLE 1.1 | US11279703, TABLE 6.147
TypeSmall organic molecule
Emp. Form.C17H18N6
Mol. Mass.306.365
SMILESN#CC[C@H](C1CCCC1)n1cc(cn1)-c1ncnc2[nH]ccc12