Reaction Details
TargetDual serine/threonine and tyrosine protein kinase
LigandBDBM24654
Substrate/Competitorn/a
Meas. Tech.ChEMBL_774238 (CHEMBL1908455)
Kd>10000±n/a nM
Citation Davis, MIHunt, JPHerrgard, SCiceri, PWodicka, LMPallares, GHocker, MTreiber, DKZarrinkar, PP Comprehensive analysis of kinase inhibitor selectivity. Nat Biotechnol29:1046-51 (2011) 
 
Dual serine/threonine and tyrosine protein kinase
Name:Dual serine/threonine and tyrosine protein kinase
Type:PROTEIN
Mol. Mass.:105208.50
Organism:Homo sapiens (Human)
Description:ChEMBL_774238
Residue:929
BDBM24654
NameBDBM24654
Synonyms:4-N-(2,6-dichlorobenzene)-3-N-(piperidin-4-yl)-1H-pyrazole-3,4-diamido JMC514986 Compound 33 | pyrazole diamide, 33
TypeSmall organic molecule
Emp. Form.C16H17Cl2N5O2
Mol. Mass.382.244
SMILESClc1cccc(Cl)c1C(=O)Nc1cn[nH]c1C(=O)NC1CCNCC1