Reaction Details
TargetCasein kinase I isoform gamma-3
LigandBDBM50355504
Substrate/Competitorn/a
Meas. Tech.ChEMBL_774429 (CHEMBL1908646)
Kd>10000±n/a nM
Citation Davis, MIHunt, JPHerrgard, SCiceri, PWodicka, LMPallares, GHocker, MTreiber, DKZarrinkar, PP Comprehensive analysis of kinase inhibitor selectivity. Nat Biotechnol29:1046-51 (2011) 
 
Casein kinase I isoform gamma-3
Name:Casein kinase I isoform gamma-3
Type:PROTEIN
Mol. Mass.:51411.12
Organism:Homo sapiens (Human)
Description:ChEMBL_1440403
Residue:447
BDBM50355504
NameBDBM50355504
Synonyms:CHEMBL1908393
TypeSmall organic molecule
Emp. Form.C34H36F2N4O6
Mol. Mass.634.6696
SMILESCOc1cc2c(Oc3ccc(NC(=O)C4(CC4)C(=O)NC4=CCC(F)C=C4)cc3F)ccnc2cc1OCCCN1CCOCC1