Reaction Details
TargetEphrin type-A receptor 4
LigandBDBM50355504
Substrate/Competitorn/a
Meas. Tech.ChEMBL_774432 (CHEMBL1908649)
Kd 1.9±n/a nM
Citation Davis, MIHunt, JPHerrgard, SCiceri, PWodicka, LMPallares, GHocker, MTreiber, DKZarrinkar, PP Comprehensive analysis of kinase inhibitor selectivity. Nat Biotechnol29:1046-51 (2011) 
 
Ephrin type-A receptor 4
Name:Ephrin type-A receptor 4
Type:PROTEIN
Mol. Mass.:109859.29
Organism:Homo sapiens (Human)
Description:ChEMBL_586961
Residue:986
BDBM50355504
NameBDBM50355504
Synonyms:CHEMBL1908393
TypeSmall organic molecule
Emp. Form.C34H36F2N4O6
Mol. Mass.634.6696
SMILESCOc1cc2c(Oc3ccc(NC(=O)C4(CC4)C(=O)NC4=CCC(F)C=C4)cc3F)ccnc2cc1OCCCN1CCOCC1