Reaction Details
TargetPhosphatidylinositol 4-phosphate 5-kinase type-1 alpha
LigandBDBM13530
Substrate/Competitorn/a
Meas. Tech.ChEMBL_774304 (CHEMBL1908521)
Kd>10000±n/a nM
Citation Davis, MIHunt, JPHerrgard, SCiceri, PWodicka, LMPallares, GHocker, MTreiber, DKZarrinkar, PP Comprehensive analysis of kinase inhibitor selectivity. Nat Biotechnol29:1046-51 (2011) 
 
Phosphatidylinositol 4-phosphate 5-kinase type-1 alpha
Name:Phosphatidylinositol 4-phosphate 5-kinase type-1 alpha
Type:PROTEIN
Mol. Mass.:62644.19
Organism:Homo sapiens (Human)
Description:ChEMBL_774304
Residue:562
BDBM13530
NameBDBM13530
Synonyms:4-[(4-methylpiperazin-1-yl)methyl]-N-[4-methyl-3-[(4-pyridin-3-ylpyrimidin-2-yl)amino]phenyl]benzamide Gleevec Imatinib, 21 STI-571 US10906896, Cpd imatinib US11725005, Compound imatinib cid_5291 med.21724, Compound 6
TypeSmall organic molecule
Emp. Form.C29H31N7O
Mol. Mass.493.6027
SMILESCN1CCN(Cc2ccc(cc2)C(=O)Nc2ccc(C)c(Nc3nccc(n3)-c3cccnc3)c2)CC1