Reaction Details
TargetMitogen-activated protein kinase kinase kinase 15
LigandBDBM21
Substrate/Competitorn/a
Meas. Tech.ChEMBL_774281 (CHEMBL1908498)
Kd>10000±n/a nM
Citation Davis, MIHunt, JPHerrgard, SCiceri, PWodicka, LMPallares, GHocker, MTreiber, DKZarrinkar, PP Comprehensive analysis of kinase inhibitor selectivity. Nat Biotechnol29:1046-51 (2011) 
 
Mitogen-activated protein kinase kinase kinase 15
Name:Mitogen-activated protein kinase kinase kinase 15
Type:PROTEIN
Mol. Mass.:147411.18
Organism:Homo sapiens (Human)
Description:ChEMBL_774281
Residue:1313
BDBM21
NameBDBM21
Synonyms:CHEMBL24828 VANDETANIB ZD6474 | cid_3081361
Typen/a
Emp. Form.C22H24BrFN4O2
Mol. Mass.475.354
SMILESCOc1cc2c(Nc3ccc(Br)cc3F)ncnc2cc1OCC1CCN(C)CC1