Reaction Details
TargetDual specificity protein kinase CLK4
LigandBDBM4814
Substrate/Competitorn/a
Meas. Tech.ChEMBL_774605 (CHEMBL1908822)
Kd 29±n/a nM
Citation Davis, MIHunt, JPHerrgard, SCiceri, PWodicka, LMPallares, GHocker, MTreiber, DKZarrinkar, PP Comprehensive analysis of kinase inhibitor selectivity. Nat Biotechnol29:1046-51 (2011) 
 
Dual specificity protein kinase CLK4
Name:Dual specificity protein kinase CLK4
Type:Serine/threonine-protein kinase
Mol. Mass.:57522.53
Organism:Homo sapiens (Human)
Description:gi_10190706
Residue:481
BDBM4814
NameBDBM4814
Synonyms:CHEMBL535 N-[2-(diethylamino)ethyl]-5-{[(3Z)-5-fluoro-2-oxo-2,3-dihydro-1H-indol-3-ylidene]methyl}-2,4-dimethyl-1H-pyrrole-3-carboxamide SUNITINIB US10464902, Sunitinib US9163010, Sunitinib | US9914707, SU11248
TypeSmall organic molecule
Emp. Form.C22H27FN4O2
Mol. Mass.398.4738
SMILESCCN(CC)CCNC(=O)c1c(C)[nH]c(\C=C2/C(=O)Nc3ccc(F)cc23)c1C