Reaction Details
TargetCyclin-dependent kinase-like 2
LigandBDBM50184807
Substrate/Competitorn/a
Meas. Tech.ChEMBL_774408 (CHEMBL1908625)
Kd>10000±n/a nM
Citation Davis, MIHunt, JPHerrgard, SCiceri, PWodicka, LMPallares, GHocker, MTreiber, DKZarrinkar, PP Comprehensive analysis of kinase inhibitor selectivity. Nat Biotechnol29:1046-51 (2011) 
 
Cyclin-dependent kinase-like 2
Name:Cyclin-dependent kinase-like 2
Type:n/a
Mol. Mass.:56031.51
Organism:Homo sapiens (Human)
Description:Q92772
Residue:493
BDBM50184807
NameBDBM50184807
Synonyms:(R)-1-(4-(4-fluoro-2-methyl-1H-indol-5-yloxy)-5-methylpyrrolo[1,2-f][1,2,4]triazin-6-yloxy)propan-2-ol BMS-540215 | CHEMBL377300
TypeSmall organic molecule
Emp. Form.C19H19FN4O3
Mol. Mass.370.3776
SMILESC[C@@H](O)COc1cn2ncnc(Oc3ccc4[nH]c(C)cc4c3F)c2c1C