Reaction Details
TargetReceptor tyrosine-protein kinase erbB-3
LigandBDBM25118
Substrate/Competitorn/a
Meas. Tech.ChEMBL_774331 (CHEMBL1908548)
Kd>10000±n/a nM
Citation Davis, MIHunt, JPHerrgard, SCiceri, PWodicka, LMPallares, GHocker, MTreiber, DKZarrinkar, PP Comprehensive analysis of kinase inhibitor selectivity. Nat Biotechnol29:1046-51 (2011) 
 
Receptor tyrosine-protein kinase erbB-3
Name:Receptor tyrosine-protein kinase erbB-3
Type:PROTEIN
Mol. Mass.:148097.73
Organism:Homo sapiens (Human)
Description:ChEMBL_774331
Residue:1342
BDBM25118
NameBDBM25118
Synonyms:(3Z)-4-amino-5-fluoro-3-[5-(4-methylpiperazino)-1,3-dihydrobenzimidazol-2-ylidene]carbostyril CHEMBL522892 | CHIR-258
TypeSmall organic molecule
Emp. Form.C21H21FN6O
Mol. Mass.392.4294
SMILESCN1CCN(CC1)c1ccc2nc([nH]c2c1)-c1c(N)c2c(F)cccc2[nH]c1=O