Reaction Details
TargetSerine/threonine-protein kinase Sgk3
LigandBDBM15138
Substrate/Competitorn/a
Meas. Tech.ChEMBL_774553 (CHEMBL1908770)
Kd 5100±n/a nM
Citation Davis, MIHunt, JPHerrgard, SCiceri, PWodicka, LMPallares, GHocker, MTreiber, DKZarrinkar, PP Comprehensive analysis of kinase inhibitor selectivity. Nat Biotechnol29:1046-51 (2011) 
 
Serine/threonine-protein kinase Sgk3
Name:Serine/threonine-protein kinase Sgk3
Type:PROTEIN
Mol. Mass.:57110.99
Organism:Homo sapiens (Human)
Description:ChEMBL_1445194
Residue:496
BDBM15138
NameBDBM15138
Synonyms:5-indazolyl pyridine 11g A-674563 indazole-pyridine, 7
TypeSmall organic molecule
Emp. Form.C22H22N4O
Mol. Mass.358.4363
SMILESCc1n[nH]c2ccc(cc12)-c1cncc(OC[C@@H](N)Cc2ccccc2)c1