Reaction Details
TargetCyclin-dependent kinase 18 [3-474]
LigandBDBM5655
Substrate/Competitorn/a
Meas. Tech.ChEMBL_774354 (CHEMBL1908571)
Kd 1100±n/a nM
Citation Davis, MIHunt, JPHerrgard, SCiceri, PWodicka, LMPallares, GHocker, MTreiber, DKZarrinkar, PP Comprehensive analysis of kinase inhibitor selectivity. Nat Biotechnol29:1046-51 (2011) 
 
Cyclin-dependent kinase 18 [3-474]
Name:Cyclin-dependent kinase 18 [3-474]
Type:PROTEIN
Mol. Mass.:54193.55
Organism:Homo sapiens (Human)
Description:ChEMBL_774354
Residue:472
BDBM5655
NameBDBM5655
Synonyms:2-(2-chlorophenyl)-5,7-dihydroxy-8-[(3S,4R)-3-hydroxy-1-methylpiperidin-4-yl]-4H-chromen-4-one Flavopiridol US9617225, Flavopiridol
TypeSmall organic molecule
Emp. Form.C21H20ClNO5
Mol. Mass.401.84
SMILESCN1CC[C@@H]([C@H](O)C1)c1c(O)cc(O)c2c1oc(cc2=O)-c1ccccc1Cl